{"text_format":"1","workbook":"xlsx","n_sheets":6,"sheets":["Input og resultat","IDF","Kommuneliste","Tables","help1","help3"],"not_rendered":{"charts":0,"images":4,"macros":1,"external_links":0,"defined_names":45,"comments":0,"pivot_tables":0},"unopened":[],"bounds":{"document_bytes":16777216,"sheet_cells":100000,"rows_first":2000,"rows_last":500,"rows_between":2000,"halvings":0,"cell_chars":16384,"cell_head_chars":4096},"cells_cut":0,"cells_raw":0,"read":"whole","date_system":"1900"}

{"sheet":"Input og resultat","index":0,"n_rows":54,"n_cols":10,"rows_kept":54,"cut":false,"hidden":false,"merged":[]}
["Nedbørskarakteristika",null,null,null,null,null,null,null,"Pil ikke - intern beregning"]
["Kommune","Holbæk",null,null,null,null,null,null,"Afskærende lednings kapacitet l/s",0.39999999999999997]
[null," ",null,null,null,null,null,null,"Volumen m³",{"$f":"IDF!M15","v":36.401020886320374}]
["Designkarakteristika",null,null,null,null,null,null,null,"Total opland (m²)",1000]
["Gentagelsesperiode (år)",5,"år"]
["Sikkerhedsfaktor (klima, fremtidig udbygning, etc)",1.1000000000000001,null,null,null,"Beregningstjek","Vol m³","Dræn kap l/s","Iterationsafstand","Antal iterationer"]
["Oplandskarakteristika",null,null,null,"Faskine",{"$f":"IF(ABS((H7-B20)/H7)<0.001,\"OK\",\"Beregn\")","v":"Beregn"},0,1.6902369634427802E-2,9.9363796601312964E-4,6]
["Befæstet areal (m²)",null,"m²",null,"Regnbed",{"$f":"IF(ABS((H8-B26)/H8)<0.001,\"OK\",\"Beregn\")","v":"Beregn"},0,0.1,0,1]
[null,null,null,null,"Grøft",{"$f":"IF(ABS((H9-B35)/H9)<0.001,\"OK\",\"Beregn\")","v":"Beregn"},1.0000000000000001E-5,2.8603328174132515E-2,9.2709732237626196E-4,2]
["Jord- og nedsivningskarakteristika ",null,null,null,"Perm. bel.",{"$f":"IF(ABS((H10-B44)/H10)<0.001,\"OK\",\"Beregn\")","v":"Beregn"},0,0.3,0,1]
["K (Hydraulisk  ledningsevne) - se evt måling nederst ",9.9999999999999995E-7,"m/s"]
[]
[]
["Faskine",null,null,null,"Hjælpestørrelser, faskine",null,null,null,"Dimensionerende kasseregn, Afløbsteknik s. 269"]
["Bredde",0.8,"m",null,"Opstuvningsvolumen",null,{"$f":"F_bredde*F_hojde*F_hulrum*F_laengde","v":0}," [m³]","Vr,k (mm)",49.225459302928556]
["Højde",0.51,"m",null,"Faskine volumen ",null,{"$f":"G15/F_hulrum","v":0}," [m³]","Varighed (h)",56.325630690043987]
["Hulrums andel i faskine [Plast: 0,95, sten: 0,25]",0.95,"0-1",null,"Regn, der holdes umiddelbart",null,{"$f":"G15/B8*1000","v":{"$error":"#DIV/0!"}}," [mm]"]
["Udsivning i faskinebund: 0=Nej ,1=ja",0,null,null,"Regn, der siver pr døgn ",null,{"$f":"B20*86400/B8","v":{"$error":"#DIV/0!"}}," [mm/døgn]","Karakteritika for dimensionerende kasseregn"]
["Længde faskine",{"$f":"G7/(B15*B16*B17)","v":0},"m",null,"Tømmetid",{"$f":"ROUND(G19/60/60,0)","v":0},{"$f":"G15/(B20/1000)","v":0}," [s]","Samlet nedbør (mm)",{"$f":"J15+G18/24*J16","v":{"$error":"#DIV/0!"}}]
["Dræn kapacitet, gennemsnit",{"$f":"((B19+B15)*B16+B18*B19*B15)*B11*1000","v":4.08E-4},"l/s",null,"Afløbstal ",null,{"$f":"B20/B8*10000","v":{"$error":"#DIV/0!"}},"[l/sek/ha]","Intensitet (l/sek/ha)",{"$f":"J19*10000/(J16*3600)","v":{"$error":"#DIV/0!"}}]
{"$rows_left_out":35}
{"sheet":"IDF","index":1,"n_rows":69,"n_cols":35,"rows_kept":69,"cut":false,"hidden":false,"merged":[]}
[null,null,null,null,null,null,null,null,null,null,null,null,"Bassindimensionering opstrøms udløb",null,null,null,null,null,null,"Regression",null,null,null,null,null,null,null,null,null,"Sæt optimering i gang"]
[null,null,null,null,null,null,null,null,null,null,null,null,"Oplandskarakteristika",null,null,null,null,null,null,null,null,null,null,null,null,null,null,null,null,"Initdummy"]
[null,null,null,null,null,null,null,null,null,null,null,null,"Befæstet areal (ha)",null,null,null,{"$f":"'Input og resultat'!J4/10000","v":0.1},null,null,"Estimates, 3 parameters:",null,null,null,null,null,null,null,null,null,{"$f":"initdummy(B3,B4,B8,B9,B10,I3,I4,I5,Q3,Q4,Q5)","v":1}]
[null,null,null,null,null,null,null,null,null,null,null,null,"Hydrologisk reduktionsfaktor (-)",null,null,null,1,null,null,"Alpha",{"$f":"EXP(X22/11+U7*W22/11)","v":139.73453511860532}]
["Årsmiddelnedbør [mm]",{"$f":"VLOOKUP('Input og resultat'!B2,Kommuneliste!A3:C101,2,FALSE)","v":618.99446813334896},"Fås fra kommunelisten",null,null,null,null,null,null,null,null,null,"Afskærende lednings kapacitet (l/s)",null,null,null,{"$f":"'Input og resultat'!J2","v":0.39999999999999997},null,null,"Theta",{"$f":"AD11","v":4.5263681120605455},null,null,null,null,null,null,null,null,"idftheta","theta"]
["Middelværdi Klimagrid [mm/dag]",{"$f":"VLOOKUP('Input og resultat'!B2,Kommuneliste!A3:C101,3,FALSE)","v":27.676026767857962},"Fås fra kommunelisten"]
[null,null,null,null,null,null,null,null,null,null,null,null,null,null,null,null,null,null,null,"Nu",{"$f":"-(Z22-W22*X22/11)/(Y22-W22^2/11)","v":0.73845561305024321},null,null,null,null,null,null,null,null,{"$f":"idftheta(AE7)","v":0.20243877898220533},1]
["Gentagelsesperiode (år)",{"$f":"'Input og resultat'!B5","v":5},{"$f":"IF(B8<1/help1!C11,CONCATENATE(\" Fejl: Indtast gentagelsesperiode > \",ROUND(1/help1!C11,2),\" år\"),\" \")","v":" "},null,null,null,null,null,null,null,null,null,"NB. Frekvens- og sikkerhedsfaktorer på regnen ",null,null,null,null,null,null,null,null,null,null,null,null,null,null,null,null,"derividf","x"]
["Sikkerhedsfaktor (Fra Skrift 27)",{"$f":"'Input og resultat'!B6","v":1.1000000000000001},"Defineret i Skrift 27, Faktor til beskrivelse af usikkerhed, klima, mv. Typisk 1.0 - 1.8",null,null,null,null,null,null,null,null,null,"indgår ved beregning af bassinvolumen",null,null,null,null,null,null,"Dur (min)","Intensity","ln(dur)","ln(dur+Theta)","ln(int)","ln(dur+Theta)^2","ln(dur+Theta)*ln(int)","Est. Intensity","Obj.Func",null,{"$f":"derividf(AE9)","v":-0.18799210405040512},{"$f":"AE7","v":1}]
[null,null,null,null,null,null,null,null,null,null,null,null,null,null,null,null,null,null,null,{"$f":"IDF!A18","v":1},{"$f":"IDF!D18","v":39.528181096689956},{"$f":"LN(T10)","v":0},{"$f":"LN(T10+$U$5)","v":1.7095308388429329},{"$f":"LN(U10)","v":3.6770138630116516},{"$f":"W10^2","v":2.922495688955022},{"$f":"W10*X10","v":6.2859685936714014},{"$f":"$U$4*(T10+$U$5)^(-$U$7)","v":39.540750614546603},{"$f":"(LN(U10)-LN(AA10))^2","v":1.010847159145489E-7},null,"bisectidf","min","max","middel","tiny"]
[null,null,null,null,null,null,null,null,null,null,null,null,null,null,null,null,null,null,null,{"$f":"IDF!A19","v":2},{"$f":"IDF!D19","v":35.026377308640278},{"$f":"LN(T11)","v":0.69314718055994529},1.8758506035770266,3.5561014150370789,3.5188154869402948,6.6707149857784227,34.970751385166956,{"$f":"(LN(U11)-LN(AA11))^2","v":2.5261212442105891E-6},null,{"$f":"bisectidf(AE11,AF11,AG11,AH11)","v":4.5263681120605455},0,60,{"$f":"(AE11+AF11)/2","v":30},{"$f":"AD3/100000","v":1.0000000000000001E-5}]
[null,null,null,null,null,null,null,null,null,null,null,null,null,null,null,null,null,null,null,{"$f":"IDF!A20","v":5},{"$f":"IDF!D20","v":26.557090353472809},1.6094379124341003,2.2540635445105472,3.2792967686626517,5.0808024626914516,7.3917432978737212,26.449005761711671,1.6631718617694065E-5]
[null,null,null,null,null,null,null,null,null,null,null,null,null,null,null,null,null,null,null,{"$f":"IDF!A21","v":10},{"$f":"IDF!D21","v":19.535128631492547},2.3025850929940459,2.6759654884614341,2.972214313153517,7.1607912954366419,7.9535429263099173,19.368784225139731,7.3129923658167242E-5]
["Design regnkurve",null,null,null,null,null,null,null,null,null,null,null,"Volumen af bassin",null,null,null,null,null,null,{"$f":"IDF!A22","v":30},{"$f":"IDF!D22","v":10.102808518758712},3.4011973816621555,3.5417233252172782,2.3128134563568223,12.543804112388134,8.1913453652553514,10.219922233362773,1.3283759121099264E-4]
[null,null,null,null,null,null,null,null,null,null,null,null,{"$f":"Q24*Q27*12","v":36.401020886320374},"m3",{"$f":"IF(Y27>0.1,\"ADVARSEL: Programmet har muligvis ikke optimeret korrekt\",\" \")","v":" "},null,null,null,null,{"$f":"IDF!A23","v":60},{"$f":"IDF!D23","v":6.2198008110335667},4.0943445622221004,4.1670739482014509,1.8277378822887231,17.364505289779228,7.6163189134262286,6.440107920512947,1.2115561759305326E-3]
["Varighed","zT","S{zT}","f*zT","Regression",null,null,null,null,null,null,null,"Effekten af koblede regn ER inkluderet (20 % ekstra volumen)",null,null,null,null,null,null,{"$f":"IDF!A24","v":180},{"$f":"IDF!D24","v":2.9941486990050512},5.1929568508902104,5.2177923698655118,1.0966599504304879,27.225357215026754,5.7221439216932906,2.9642865560984069,1.0047193197206024E-4]
["(min)","(mm/s)","(mm/s)","(mm/s)","(mm/s)",null,null,null,null,null,null,null,null,null,null,null,null,null,null,{"$f":"IDF!A25","v":360},{"$f":"IDF!D25","v":1.8397365597155493},5.8861040314501558,5.8985988893317449,0.60962238730287277,34.793468857225697,3.595917936656492,1.7930014187697658,6.6210501788205702E-4]
[1,{"$f":"help1!B17","v":35.934710087899958},{"$f":"help1!C17","v":3.2324901594357835},{"$f":"$B$9*B18","v":39.528181096689956},{"$f":"IDF!$U$4*(A18+IDF!$U$5)^(-IDF!$U$7)","v":39.540750614546603},null,null,null,null,null,null,null,null,null,null,null,null,null,null,{"$f":"IDF!A26","v":720},{"$f":"IDF!D26","v":1.0937347287240422},6.5792512120101012,6.5855181560081348,8.9598196282766052E-2,43.369049383112788,0.59005054836573645,1.0796442597073923,1.6813267839732476E-4]
[2,{"$f":"help1!B18","v":31.842161189672975},{"$f":"help1!C18","v":2.6766201311040834},35.026377308640278,{"$f":"IDF!$U$4*(A19+IDF!$U$5)^(-IDF!$U$7)","v":34.970751385166956},null,null,null,null,null,null,null,null,null,null,null,null,null,null,{"$f":"IDF!A27","v":1440},{"$f":"IDF!D27","v":0.6564814862374313},7.2723983925700466,7.2755367738844141,-0.42086078634153168,52.933435348144428,-3.0619881277137249,0.6486146334533065,1.4534080480258223E-4]
[5,{"$f":"help1!B19","v":24.142809412248006},{"$f":"help1!C19","v":1.6177553092013575},26.557090353472809,{"$f":"IDF!$U$4*(A20+IDF!$U$5)^(-IDF!$U$7)","v":26.449005761711671},null,null,null,null,null,null,null,null,null,null,null,null,null,null,{"$f":"IDF!A28","v":2880},{"$f":"IDF!D28","v":0.37833974286701894},7.965545573129992,7.9671159949663295,-0.97196269637952082,63.47493727724833,-7.7437395448358828,0.38921745493304472,8.0347388624383339E-4]
{"$rows_left_out":50}
{"sheet":"Kommuneliste","index":2,"n_rows":101,"n_cols":5,"rows_kept":101,"cut":false,"hidden":false,"merged":[]}
[null,"Årsmiddelnedbør","Middelværdi Klimagrid",null,"Faskinebund"]
["Kommuner","mm","mm/dag",null,"Nej/ja"]
["Albertslund",632.49007681987212,27.704998074179372,null,0]
["Allerød",674.10474259425848,27.91964123273647,null,1]
["Assens",697.02257492452702,25.833864009599534]
["Ballerup",647.05121493735714,27.724669202840431,null,"Note: Årsmiddelbøren er et maksimum af nedbøren i 5 punkter: "]
["Billund",906.63431520239408,26.231368235573651,null,"1: Kommunecentrum, samt 4 punkter, 15 km i n, s, ø, v fra kommunecentrum"]
["Bogense",673.60094135524582,25.749728966587114]
["Bornholm",696.05765684502512,28.983963279571785]
["Brøndby",644.89390717471429,28.189741274128249]
["Brønderslev-Dronninglund",709.81276643852414,27.38203116147827]
["Christiansø",610.00481300220338,29.013117650730955]
["Dragør",618.40528349083354,27.702569556270326]
["Egedal",651.34989077687703,28.096702818721255]
["Esbjerg",838.87384249581839,25.914605711181508]
["Fanø",809.84253030991022,25.539973514944027]
["Favrskov",699.71554380310863,25.60518000976495]
["Faxe",629.2901111571515,27.201269581405363]
["Fredensborg",661.90620101997285,28.35961029868227]
["Fredericia",778.80905053333368,25.308901015275019]
{"$rows_left_out":82}
{"sheet":"Tables","index":3,"n_rows":48,"n_cols":12,"rows_kept":48,"cut":false,"hidden":false,"merged":[]}
["LAMBDA"]
[]
["Variabel","b_0","b_1","V(b_0)","Cov","V(b_1)","Res.var.",null,"E(lambda)","V(lambda)",null,"z_0"]
["i1m",0.24529999999999999,6.1120000000000002E-3,0.76290000000000002,-1.106E-3,1.6819999999999999E-6,0.34310000000000002,null,{"$f":"B4+C4*IDF!$B$5","v":4.0285941892310291},{"$f":"D4+2*E4*IDF!$B$5+F4*IDF!$B$5^2+G4","v":0.38124951944606661},null,15.8]
["i2m",0.84870000000000001,5.1929999999999997E-3,0.83099999999999996,-1.2030000000000001E-3,1.8300000000000001E-6,0.3977,null,{"$f":"B5+C5*IDF!$B$5","v":4.0631382730164809},{"$f":"D5+2*E5*IDF!$B$5+F5*IDF!$B$5^2+G5","v":0.44057140706199044},null,12.8]
["i5m",1.298,4.2919999999999998E-3,0.83160000000000001,-1.2049999999999999E-3,1.8330000000000001E-6,0.4007,null,{"$f":"B6+C6*IDF!$B$5","v":3.9547242572283339},{"$f":"D6+2*E6*IDF!$B$5+F6*IDF!$B$5^2+G6","v":0.44284489164419644},null,9]
["i10m",1.6639999999999999,4.3660000000000001E-3,1.06,-1.5410000000000001E-3,2.3470000000000001E-6,0.53459999999999996,null,{"$f":"B7+C7*IDF!$B$5","v":4.3665298478702015},{"$f":"D7+2*E7*IDF!$B$5+F7*IDF!$B$5^2+G7","v":0.58612184297054515},null,6]
["i30m",1.9690000000000001,3.2499999999999999E-3,0.90300000000000002,-1.307E-3,1.9860000000000001E-6,0.42330000000000001,null,{"$f":"B8+C8*IDF!$B$5","v":3.9807320214333837},{"$f":"D8+2*E8*IDF!$B$5+F8*IDF!$B$5^2+G8","v":0.46919260533668539},null,3.2]
["i60m",2.1779999999999999,2.735E-3,0.90800000000000003,-1.3129999999999999E-3,1.9929999999999998E-6,0.40939999999999999,null,{"$f":"B9+C9*IDF!$B$5","v":3.8709498703447096},{"$f":"D9+2*E9*IDF!$B$5+F9*IDF!$B$5^2+G9","v":0.45554675078014284},null,2.1]
["i3h",1.76,2.7200000000000002E-3,0.75970000000000004,-1.0939999999999999E-3,1.658E-6,0.30880000000000002,null,{"$f":"B10+C10*IDF!$B$5","v":3.4436649533227093},{"$f":"D10+2*E10*IDF!$B$5+F10*IDF!$B$5^2+G10","v":0.34940968704335457},null,1.1000000000000001]
["i6h",0.87270000000000003,3.5969999999999999E-3,0.73370000000000002,-1.0510000000000001E-3,1.5880000000000001E-6,0.30640000000000001,null,{"$f":"B11+C11*IDF!$B$5","v":3.0992231018756562},{"$f":"D11+2*E11*IDF!$B$5+F11*IDF!$B$5^2+G11","v":0.34742242069224438},null,0.73]
["i12h",3.9120000000000002E-2,4.4149999999999997E-3,0.70840000000000003,-1.0139999999999999E-3,1.5319999999999999E-6,0.30959999999999999,null,{"$f":"B12+C12*IDF!$B$5","v":2.7719805768087356},{"$f":"D12+2*E12*IDF!$B$5+F12*IDF!$B$5^2+G12","v":0.34967137884564969},null,0.45]
["i24h",-1.518,7.051E-3,0.68840000000000001,-9.7740000000000001E-4,1.4729999999999999E-6,0.28060000000000002,null,{"$f":"B13+C13*IDF!$B$5","v":2.8465299948082441},{"$f":"D13+2*E13*IDF!$B$5+F13*IDF!$B$5^2+G13","v":0.32337567896980918},null,0.26]
["i48h",-2.7410000000000001,9.4909999999999994E-3,0.6109,-8.6019999999999998E-4,1.2929999999999999E-6,0.2127,null,{"$f":"B14+C14*IDF!$B$5","v":3.1338764970536146},{"$f":"D14+2*E14*IDF!$B$5+F14*IDF!$B$5^2+G14","v":0.25410023501592238},null,0.15]
[]
[]
["MEAN"]
[]
["Variabel","b_0","b_1","V(b_0)","Cov","V(b_1)","Res.var.",null,"E(Mean)","V(Mean)"]
["i1m",6.2229999999999999,0,1.9910000000000001E-2,0,0,0.22120000000000001,null,{"$f":"B20+C20*IDF!$B$6","v":6.2229999999999999},{"$f":"D20+2*E20*IDF!$B$6+F20*IDF!$B$6^2+G20","v":0.24111000000000002}]
{"$rows_left_out":29}
{"sheet":"help1","index":4,"n_rows":27,"n_cols":23,"rows_kept":27,"cut":false,"hidden":false,"merged":[]}
["Variable","i1m",null,"i2m",null,"i5m",null,"i10m",null,"i30m",null,"i60m",null,"i3h",null,"i6h",null,"i12h",null,"i24h",null,"i48h"]
[]
["q0",{"$f":"Tables!$L$4","v":15.8},null,{"$f":"Tables!$L$5","v":12.8},null,{"$f":"Tables!$L$6","v":9},null,{"$f":"Tables!$L$7","v":6},null,{"$f":"Tables!$L$8","v":3.2},null,{"$f":"Tables!$L$9","v":2.1},null,{"$f":"Tables!$L$10","v":1.1000000000000001},null,{"$f":"Tables!$L$11","v":0.73},null,{"$f":"Tables!$L$12","v":0.45},null,{"$f":"Tables!$L$13","v":0.26},null,{"$f":"Tables!$L$14","v":0.15}]
["lambda",{"$f":"Tables!$I$4","v":4.0285941892310291},null,{"$f":"Tables!$I$5","v":4.0631382730164809},null,{"$f":"Tables!$I$6","v":3.9547242572283339},null,{"$f":"Tables!$I$7","v":4.3665298478702015},null,{"$f":"Tables!$I$8","v":3.9807320214333837},null,{"$f":"Tables!$I$9","v":3.8709498703447096},null,{"$f":"Tables!$I$10","v":3.4436649533227093},null,{"$f":"Tables!$I$11","v":3.0992231018756562},null,{"$f":"Tables!$I$12","v":2.7719805768087356},null,{"$f":"Tables!$I$13","v":2.8465299948082441},null,{"$f":"Tables!$I$14","v":3.1338764970536146}]
["mean",{"$f":"Tables!$I$20","v":6.2229999999999999},null,{"$f":"Tables!I21","v":5.9939999999999998},null,{"$f":"Tables!I22","v":4.8959999999999999},null,{"$f":"Tables!I23","v":3.577},null,{"$f":"Tables!I24","v":1.8220000000000001},null,{"$f":"Tables!I25","v":1.0960000000000001},null,{"$f":"Tables!I26","v":0.53296521190502744},null,{"$f":"Tables!I27","v":0.32440270173734409},null,{"$f":"Tables!I28","v":0.19926843983180159},null,{"$f":"Tables!I29","v":0.12225664216911825},null,{"$f":"Tables!I30","v":6.8270548745397161E-2}]
["kappa",{"$f":"Tables!$E$37","v":-0.15804015472462707},null,{"$f":"Tables!$E$38","v":-0.10964083175803419},null,{"$f":"Tables!$E$39","v":-7.4330829963412226E-2},null,{"$f":"Tables!$E$40","v":-0.12241832519714602},null,{"$f":"Tables!$E$41","v":-0.20724273933309423},null,{"$f":"Tables!$E$42","v":-0.20692128384436059},null,{"$f":"Tables!$E$43","v":-0.17518248175182505},null,{"$f":"Tables!$E$44","v":-0.18016378525932653},null,{"$f":"Tables!$E$45","v":-0.13745576457440878},null,{"$f":"Tables!$E$46","v":-0.12382739212007521},null,{"$f":"Tables!$E$47","v":-8.9415361100496638E-2}]
["V_lambda",{"$f":"Tables!$J$4","v":0.38124951944606661},null,{"$f":"Tables!$J$5","v":0.44057140706199044},null,{"$f":"Tables!$J$6","v":0.44284489164419644},null,{"$f":"Tables!$J$7","v":0.58612184297054515},null,{"$f":"Tables!$J$8","v":0.46919260533668539},null,{"$f":"Tables!$J$9","v":0.45554675078014284},null,{"$f":"Tables!$J$10","v":0.34940968704335457},null,{"$f":"Tables!$J$11","v":0.34742242069224438},null,{"$f":"Tables!$J$12","v":0.34967137884564969},null,{"$f":"Tables!$J$13","v":0.32337567896980918},null,{"$f":"Tables!$J$14","v":0.25410023501592238}]
["V_mean",{"$f":"Tables!$J$20","v":0.24111000000000002},null,{"$f":"Tables!J21","v":0.14415},null,{"$f":"Tables!J22","v":8.7299999999999989E-2},null,{"$f":"Tables!J23","v":5.0432999999999999E-2},null,{"$f":"Tables!J24","v":2.7143999999999998E-2},null,{"$f":"Tables!J25","v":1.2983999999999999E-2},null,{"$f":"Tables!J26","v":1.7539111606429127E-3},null,{"$f":"Tables!J27","v":7.1422246059612172E-4},null,{"$f":"Tables!J28","v":1.1943867527024801E-4},null,{"$f":"Tables!J29","v":3.4131845476989664E-5},null,{"$f":"Tables!J30","v":2.4594647338540192E-5}]
["V_kappa",{"$f":"Tables!$G$37","v":5.8845258979093977E-3},null,{"$f":"Tables!$G$38","v":4.6328110762261518E-3},null,{"$f":"Tables!$G$39","v":1.5950881874595754E-3},null,{"$f":"Tables!$G$40","v":1.7398963909741577E-3},null,{"$f":"Tables!$G$41","v":2.4956454726895259E-3},null,{"$f":"Tables!$G$42","v":5.3701074299806941E-3},null,{"$f":"Tables!$G$43","v":5.9002583067397632E-3},null,{"$f":"Tables!$G$44","v":4.9772986988451862E-4},null,{"$f":"Tables!$G$45","v":4.6284509328922314E-3},null,{"$f":"Tables!$G$46","v":4.1533179004050232E-3},null,{"$f":"Tables!$G$47","v":4.6437401426242409E-3}]
[]
["Min Lanbda",null,{"$f":"MIN(B4:V4)","v":2.7719805768087356}]
[]
["T","z_T","S(z_T)","z_T","S(z_T)","z_T","S(z_T)","z_T","S(z_T)","z_T","S(z_T)","z_T","S(z_T)","z_T","S(z_T)","z_T","S(z_T)","z_T","S(z_T)","z_T","S(z_T)","z_T","S(z_T)"]
[{"$f":"IDF!B8","v":5},{"$f":"B$5*(1+B$6)/B$6*(1-(1/($A14*B$4))^B$6)+B$3","v":35.934710087899958},{"$f":"SQRT(((1+B$6)*B$5*$A14*(B$4*$A14)^(-B$6-1))^2*B$7+((1+B$6)/B$6*(1-(1/($A14*B$4))^B$6))^2*B$8+((1+B$6)*B$5*((B$4*$A14)^(-B$6)/B$6*LN(B$4*$A14)-1/B$6^2*(1-(B$4*$A14)^(-B$6))))^2*B$9)","v":3.2324901594357835},{"$f":"D$5*(1+D$6)/D$6*(1-(1/($A14*D$4))^D$6)+D$3","v":31.842161189672975},{"$f":"SQRT(((1+D$6)*D$5*$A14*(D$4*$A14)^(-D$6-1))^2*D$7+((1+D$6)/D$6*(1-(1/($A14*D$4))^D$6))^2*D$8+((1+D$6)*D$5*((D$4*$A14)^(-D$6)/D$6*LN(D$4*$A14)-1/D$6^2*(1-(D$4*$A14)^(-D$6))))^2*D$9)","v":2.6766201311040834},{"$f":"F$5*(1+F$6)/F$6*(1-(1/($A14*F$4))^F$6)+F$3","v":24.142809412248006},{"$f":"SQRT(((1+F$6)*F$5*$A14*(F$4*$A14)^(-F$6-1))^2*F$7+((1+F$6)/F$6*(1-(1/($A14*F$4))^F$6))^2*F$8+((1+F$6)*F$5*((F$4*$A14)^(-F$6)/F$6*LN(F$4*$A14)-1/F$6^2*(1-(F$4*$A14)^(-F$6))))^2*F$9)","v":1.6177553092013575},{"$f":"H$5*(1+H$6)/H$6*(1-(1/($A14*H$4))^H$6)+H$3","v":17.759207846811407},{"$f":"SQRT(((1+H$6)*H$5*$A14*(H$4*$A14)^(-H$6-1))^2*H$7+((1+H$6)/H$6*(1-(1/($A14*H$4))^H$6))^2*H$8+((1+H$6)*H$5*((H$4*$A14)^(-H$6)/H$6*LN(H$4*$A14)-1/H$6^2*(1-(H$4*$A14)^(-H$6))))^2*H$9)","v":1.3547617856952057},{"$f":"J$5*(1+J$6)/J$6*(1-(1/($A14*J$4))^J$6)+J$3","v":9.184371380689738},{"$f":"SQRT(((1+J$6)*J$5*$A14*(J$4*$A14)^(-J$6-1))^2*J$7+((1+J$6)/J$6*(1-(1/($A14*J$4))^J$6))^2*J$8+((1+J$6)*J$5*((J$4*$A14)^(-J$6)/J$6*LN(J$4*$A14)-1/J$6^2*(1-(J$4*$A14)^(-J$6))))^2*J$9)","v":0.86559068915736725},{"$f":"L$5*(1+L$6)/L$6*(1-(1/($A14*L$4))^L$6)+L$3","v":5.6543643736668781},{"$f":"SQRT(((1+L$6)*L$5*$A14*(L$4*$A14)^(-L$6-1))^2*L$7+((1+L$6)/L$6*(1-(1/($A14*L$4))^L$6))^2*L$8+((1+L$6)*L$5*((L$4*$A14)^(-L$6)/L$6*LN(L$4*$A14)-1/L$6^2*(1-(L$4*$A14)^(-L$6))))^2*L$9)","v":0.62890107064041334},{"$f":"N$5*(1+N$6)/N$6*(1-(1/($A14*N$4))^N$6)+N$3","v":2.7219533627318646},{"$f":"SQRT(((1+N$6)*N$5*$A14*(N$4*$A14)^(-N$6-1))^2*N$7+((1+N$6)/N$6*(1-(1/($A14*N$4))^N$6))^2*N$8+((1+N$6)*N$5*((N$4*$A14)^(-N$6)/N$6*LN(N$4*$A14)-1/N$6^2*(1-(N$4*$A14)^(-N$6))))^2*N$9)","v":0.26177160645384473},{"$f":"P$5*(1+P$6)/P$6*(1-(1/($A14*P$4))^P$6)+P$3","v":1.6724877815595902},{"$f":"SQRT(((1+P$6)*P$5*$A14*(P$4*$A14)^(-P$6-1))^2*P$7+((1+P$6)/P$6*(1-(1/($A14*P$4))^P$6))^2*P$8+((1+P$6)*P$5*((P$4*$A14)^(-P$6)/P$6*LN(P$4*$A14)-1/P$6^2*(1-(P$4*$A14)^(-P$6))))^2*P$9)","v":0.11776533696827006},{"$f":"R$5*(1+R$6)/R$6*(1-(1/($A14*R$4))^R$6)+R$3","v":0.99430429884003835},{"$f":"SQRT(((1+R$6)*R$5*$A14*(R$4*$A14)^(-R$6-1))^2*R$7+((1+R$6)/R$6*(1-(1/($A14*R$4))^R$6))^2*R$8+((1+R$6)*R$5*((R$4*$A14)^(-R$6)/R$6*LN(R$4*$A14)-1/R$6^2*(1-(R$4*$A14)^(-R$6))))^2*R$9)","v":7.951993752162545E-2},{"$f":"T$5*(1+T$6)/T$6*(1-(1/($A14*T$4))^T$6)+T$3","v":0.59680135112493748},{"$f":"SQRT(((1+T$6)*T$5*$A14*(T$4*$A14)^(-T$6-1))^2*T$7+((1+T$6)/T$6*(1-(1/($A14*T$4))^T$6))^2*T$8+((1+T$6)*T$5*((T$4*$A14)^(-T$6)/T$6*LN(T$4*$A14)-1/T$6^2*(1-(T$4*$A14)^(-T$6))))^2*T$9)","v":4.5463401530362567E-2},{"$f":"V$5*(1+V$6)/V$6*(1-(1/($A14*V$4))^V$6)+V$3","v":0.343945220788199},{"$f":"SQRT(((1+V$6)*V$5*$A14*(V$4*$A14)^(-V$6-1))^2*V$7+((1+V$6)/V$6*(1-(1/($A14*V$4))^V$6))^2*V$8+((1+V$6)*V$5*((V$4*$A14)^(-V$6)/V$6*LN(V$4*$A14)-1/V$6^2*(1-(V$4*$A14)^(-V$6))))^2*V$9)","v":2.6839125589760159E-2}]
[]
["Dur(min)","z_T","S_T"]
[1,{"$f":"B14","v":35.934710087899958},{"$f":"C14","v":3.2324901594357835}]
[2,{"$f":"D14","v":31.842161189672975},{"$f":"E14","v":2.6766201311040834}]
[5,{"$f":"F14","v":24.142809412248006},{"$f":"G14","v":1.6177553092013575}]
[10,{"$f":"H14","v":17.759207846811407},{"$f":"I14","v":1.3547617856952057}]
{"$rows_left_out":8}
{"sheet":"help3","index":5,"n_rows":32,"n_cols":18,"rows_kept":32,"cut":false,"hidden":false,"merged":[]}
["Variable",null,"bv1","bv2",null,null,null,null,null,null,null,null,"LAMBDA"]
[]
["z0",null,{"$f":"Q4","v":17},{"$f":"Q5","v":5.4},null,null,null,null,null,null,null,null,"Variable","b_0","b_1",null,"z_0","E(lambda)"]
["lambda",null,{"$f":"R4","v":2.9423724190337008},{"$f":"R5","v":3.5266693690201603},null,null,null,null,null,null,null,null,"bv1",-1.0389999999999999,6.4320000000000002E-3,null,17,{"$f":"N4+O4*IDF!$B$5","v":2.9423724190337008}]
["mean",null,{"$f":"Q10","v":11.700039758268705},{"$f":"Q11","v":5.2354987271216586},null,null,null,null,null,null,null,null,"bv2",2.4489999999999998,1.7409999999999999E-3,null,5.4,{"$f":"N5+O5*IDF!$B$5","v":3.5266693690201603}]
["kappa",null,{"$f":"O17","v":-0.17418294686872371},{"$f":"O18","v":-0.12382739212007521}]
[null,null,null,null,null,null,null,null,null,null,null,null,"MEAN"]
[]
[null,null,null,null,null,null,"Incl. koblede regn, f-faktor 0, s-faktor 1",null,null,null,null,null,"Variable","b_0","b_1",null,"E(mean)"]
["T =",{"$f":"IDF!B8","v":5},{"$f":"C$5*(1+C$6)/C$6*(1-(1/($B10*C$4))^C$6)+C$3","v":50.133059556476816},{"$f":"D$5*(1+D$6)/D$6*(1-(1/($B10*D$4))^D$6)+D$3","v":21.206875212080568},null,0.1,{"$f":"C10","v":50.133059556476816},null,null,null,null,null,"bv1",-17,1.0369999999999999,null,{"$f":"N10+O10*IDF!B6","v":11.700039758268705}]
[null,null,null,null,null,1,{"$f":"D10","v":21.206875212080568},null,null,null,null,null,"bv2",-2.5470000000000002,0.28120000000000001,null,{"$f":"N11+O11*IDF!B6","v":5.2354987271216586}]
[]
[null,null,null,null,null,null,null,null,null,null,null,null,"L-CV"]
[]
[null,null,null,null,null,null,null,null,null,null,null,null,null,null,"Kappa"]
[null,null,null,null,null,null,null,null,null,null,null,null,"Variable","mean","mean"]
[null,null,null,null,null,null,null,null,null,null,null,null,"bv1",0.54769999999999996,{"$f":"1/N17-2","v":-0.17418294686872371}]
[null,null,null,null,null,null,null,null,null,null,null,null,"bv2",0.53300000000000003,{"$f":"1/N18-2","v":-0.12382739212007521}]
[]
[]
{"$rows_left_out":12}